Target
Genome polyprotein
Ligand
BDBM50158796
Substrate
Meas. Tech.
ChEMBL_302596 (CHEMBL838564)
Ki
23±n/a nM
Citation
 Gordon, CPKeller, PA Control of hepatitis C: a medicinal chemistry perspective. J Med Chem 48:1-20 (2005)  
Target
Name:
Genome polyprotein
Synonyms:
Hepatitis C virus NS3 protease/helicase | Hepatitis C virus serine protease, NS3/NS4A
Type:
Protein
Mol. Mass.:
67067.41
Organism:
Hepatitis C virus
Description:
A3EZI9
Residue:
631
  
Inhibitor
Name:
BDBM50158796
Synonyms:
AcAsp-D-Glu-Leu-Glu-Cha-Cys | CHEMBL360025
Type:
Small organic molecule
Emp. Form.:
C35H56N6O14S
Mol. Mass.:
816.916
SMILES:
CC(C)C[C@H](NC(=O)[C@@H](CCC(O)=O)NC(=O)[C@@H](NC(C)=O)C(C)C(O)=O)C(=O)N[C@@H](CCC(O)=O)C(=O)N[C@@H](CC1CCCCC1)C(=O)N[C@@H](CS)C(O)=O
: