Target
Cytochrome P450 3A4
Ligand
BDBM12356
Substrate
Meas. Tech.
ChEMBL_305744 (CHEMBL829416)
IC50
152000±n/a nM
Citation
 Denton, TTZhang, XCashman, JR 5-substituted, 6-substituted, and unsubstituted 3-heteroaromatic pyridine analogues of nicotine as selective inhibitors of cytochrome P-450 2A6. J Med Chem 48:224-39 (2005)  
Target
Name:
Cytochrome P450 3A4
Synonyms:
Albendazole monooxygenase CP3A4_HUMAN CYP3A4 CYPIIIA4 Cytochrome P450 3A4 (CYP3A4) Nifedipine oxidase Taurochenodeoxycholate 6-alpha-hydroxylase
Type:
Enzyme
Mol. Mass.:
57349.57
Organism:
Homo sapiens (Human)
Description:
Residue:
503
  
Inhibitor
Name:
BDBM12356
Synonyms:
3-(2-methyl-1H-imidazol-1-yl)pyridine US8609708,13 nicotine 3-heteroaromatic analogue 9
Type:
Small organic molecule
Emp. Form.:
C9H9N3
Mol. Mass.:
159.1879
SMILES:
Cc1nccn1-c1cccnc1
: