Target
Cytochrome P450 2B6
Ligand
BDBM12356
Substrate
Meas. Tech.
ChEMBL_305740 (CHEMBL829412)
IC50
>300000±n/a nM
Citation
 Denton, TTZhang, XCashman, JR 5-substituted, 6-substituted, and unsubstituted 3-heteroaromatic pyridine analogues of nicotine as selective inhibitors of cytochrome P-450 2A6. J Med Chem 48:224-39 (2005)  
Target
Name:
Cytochrome P450 2B6
Synonyms:
CP2B6_HUMAN Cytochrome P450 2B6 (CYP2B6)
Type:
Protein
Mol. Mass.:
56289.75
Organism:
Homo sapiens (Human)
Description:
P20813
Residue:
491
  
Inhibitor
Name:
BDBM12356
Synonyms:
3-(2-methyl-1H-imidazol-1-yl)pyridine US8609708,13 nicotine 3-heteroaromatic analogue 9
Type:
Small organic molecule
Emp. Form.:
C9H9N3
Mol. Mass.:
159.1879
SMILES:
Cc1nccn1-c1cccnc1
: