Target
D(2) dopamine receptor
Ligand
BDBM50071959
Substrate
Meas. Tech.
ChEMBL_303116 (CHEMBL829625)
Ki
217±n/a nM
Citation
 Newman, AHGrundt, PNader, MA Dopamine D3 receptor partial agonists and antagonists as potential drug abuse therapeutic agents. J Med Chem 48:3663-79 (2005)  
Target
Name:
D(2) dopamine receptor
Synonyms:
Dopamine D2 receptor | Dopamine Receptor D2
Type:
Mol. Mass.:
Description:
ASSAY_ID of EBI is 302528
Components:
This complex has 2 components.
Component 1
Name:
D(2) dopamine receptor
Synonyms:
D(2) dopamine receptor DOPAMINE D2 Long DRD2 Dopamine D2 receptor Dopamine D2 receptor (D2R) Dopamine2-like | d2
Type:
Cell-surface receptors
Mol. Mass.:
50647.10
Organism:
Homo sapiens (Human)
Description:
P14416
Residue:
443
  
Component 2
Name:
D(2) dopamine receptor
Synonyms:
DOPAMINE D2 DOPAMINE D2 Short Dopamine D2 receptor Drd2
Type:
G Protein-Coupled Receptor (GPCR)
Mol. Mass.:
50931.60
Organism:
Rattus norvegicus (rat)
Description:
P61169
Residue:
444
  
Inhibitor
Name:
BDBM50071959
Synonyms:
9H-Fluorene-2-carboxylic acid {4-[4-(2,3-dichloro-phenyl)-piperazin-1-yl]-butyl}-amide N-(4-(4-(2,3-dichlorophenyl)piperazin-1-yl)butyl)-9H-fluorene-2-carboxamide
Type:
Small organic molecule
Emp. Form.:
C28H29Cl2N3O
Mol. Mass.:
494.455
SMILES:
Clc1cccc(N2CCN(CCCCNC(=O)c3ccc-4c(Cc5ccccc-45)c3)CC2)c1Cl
: