Target
D(3) dopamine receptor
Ligand
BDBM50161214
Substrate
Meas. Tech.
ChEMBL_312900 (CHEMBL827420)
IC50
3.01±n/a nM
Citation
 Newman, AHGrundt, PNader, MA Dopamine D3 receptor partial agonists and antagonists as potential drug abuse therapeutic agents. J Med Chem 48:3663-79 (2005)  
Target
Name:
D(3) dopamine receptor
Synonyms:
DOPAMINE D3 DRD3_HUMAN Dopamine D3 receptor (D3) Dopamine receptor Dopamine receptor D3
Type:
Mol. Mass.:
44243.43
Organism:
Homo sapiens (Human)
Description:
Residue:
400
  
Inhibitor
Name:
BDBM50161214
Synonyms:
CHEMBL180010 N-{4-[4-(2,3-Dichloro-phenyl)-piperazin-1-yl]-but-2-enyl}-4-pyridin-2-yl-benzamide | PG-01037
Type:
Small organic molecule
Emp. Form.:
C26H26Cl2N4O
Mol. Mass.:
481.417
SMILES:
Clc1cccc(N2CCN(C\C=C\CNC(=O)c3ccc(cc3)-c3ccccn3)CC2)c1Cl
: