Target
Cytochrome P450 1A2
Ligand
BDBM50159262
Substrate
Meas. Tech.
ChEMBL_305428 (CHEMBL830921)
IC50
21000±n/a nM
Citation
 Korhonen, LERahnasto, MMähönen, NJWittekindt, CPoso, AJuvonen, RORaunio, H Predictive three-dimensional quantitative structure-activity relationship of cytochrome P450 1A2 inhibitors. J Med Chem 48:3808-15 (2005)  
Target
Name:
Cytochrome P450 1A2
Synonyms:
CP1A2_HUMAN CYPIA2 Cytochrome P(3)450 Cytochrome P450 1A2 (CYP1A2) Cytochrome P450-P3
Type:
Enzyme
Mol. Mass.:
58423.38
Organism:
Homo sapiens (Human)
Description:
P05177
Residue:
516
  
Inhibitor
Name:
BDBM50159262
Synonyms:
3-Methyl-isoquinoline CHEMBL191667
Type:
Small organic molecule
Emp. Form.:
C10H9N
Mol. Mass.:
143.1852
SMILES:
Cc1cc2ccccc2cn1
: