Target
Cytochrome P450 1A2
Ligand
BDBM50168006
Substrate
Meas. Tech.
ChEMBL_305428 (CHEMBL830921)
IC50
1200000±n/a nM
Citation
 Korhonen, LERahnasto, MMähönen, NJWittekindt, CPoso, AJuvonen, RORaunio, H Predictive three-dimensional quantitative structure-activity relationship of cytochrome P450 1A2 inhibitors. J Med Chem 48:3808-15 (2005)  
Target
Name:
Cytochrome P450 1A2
Synonyms:
CP1A2_HUMAN CYPIA2 Cytochrome P(3)450 Cytochrome P450 1A2 (CYP1A2) Cytochrome P450-P3
Type:
Enzyme
Mol. Mass.:
58423.38
Organism:
Homo sapiens (Human)
Description:
P05177
Residue:
516
  
Inhibitor
Name:
BDBM50168006
Synonyms:
2,3-Dihydro-benzofuran | CHEMBL370688
Type:
Small organic molecule
Emp. Form.:
C8H8O
Mol. Mass.:
120.1485
SMILES:
C1Cc2ccccc2O1
: