Target
Cytochrome P450 1A2
Ligand
BDBM50159252
Substrate
Meas. Tech.
ChEMBL_305428 (CHEMBL830921)
IC50
230000±n/a nM
Citation
 Korhonen, LERahnasto, MMähönen, NJWittekindt, CPoso, AJuvonen, RORaunio, H Predictive three-dimensional quantitative structure-activity relationship of cytochrome P450 1A2 inhibitors. J Med Chem 48:3808-15 (2005)  
Target
Name:
Cytochrome P450 1A2
Synonyms:
CP1A2_HUMAN CYPIA2 Cytochrome P(3)450 Cytochrome P450 1A2 (CYP1A2) Cytochrome P450-P3
Type:
Enzyme
Mol. Mass.:
58423.38
Organism:
Homo sapiens (Human)
Description:
P05177
Residue:
516
  
Inhibitor
Name:
BDBM50159252
Synonyms:
1-chloro-2-phenylbenzene 2-Chlorobiphenyl 2-chloro-1,1'-biphenyl CHEMBL191745 o-chlorodiphenyl
Type:
Small organic molecule
Emp. Form.:
C12H9Cl
Mol. Mass.:
188.653
SMILES:
Clc1ccccc1-c1ccccc1
: