Target
Solute carrier family 15 member 1
Ligand
BDBM50169215
Substrate
Meas. Tech.
ChEMBL_302952 (CHEMBL841787)
Ki
100000±n/a nM
Citation
 Biegel, AGebauer, SHartrodt, BBrandsch, MNeubert, KThondorf, I Three-dimensional quantitative structure-activity relationship analyses of beta-lactam antibiotics and tripeptides as substrates of the mammalian H+/peptide cotransporter PEPT1. J Med Chem 48:4410-9 (2005)  
Target
Name:
Solute carrier family 15 member 1
Synonyms:
Intestinal H(+)/peptide cotransporter Oligopeptide transporter, small intestine isoform Peptide transporter 1 SLC15A1
Type:
PROTEIN
Mol. Mass.:
78818.07
Organism:
Homo sapiens (Human)
Description:
ChEMBL_1488839
Residue:
708
  
Inhibitor
Name:
BDBM50169215
Synonyms:
2-{[(S)-1-((S)-2-Amino-4-methyl-pentanoyl)-pyrrolidine-2-carbonyl]-amino}-5-guanidino-pentanoic acid | CHEMBL361278
Type:
Small organic molecule
Emp. Form.:
C17H32N6O4
Mol. Mass.:
384.4738
SMILES:
CC(C)C[C@H](N)C(=O)N1CCC[C@H]1C(=O)N[C@@H](CCCNC(N)=N)C(O)=O
: