Target
3-beta-hydroxysteroid-Delta(8),Delta(7)-isomerase
Ligand
BDBM50170658
Substrate
Meas. Tech.
ChEMBL_303691 (CHEMBL829736)
Ki
583±n/a nM
Citation
 Laggner, CSchieferer, CFiechtner, BPoles, GHoffmann, RDGlossmann, HLanger, TMoebius, FF Discovery of high-affinity ligands of sigma1 receptor, ERG2, and emopamil binding protein by pharmacophore modeling and virtual screening. J Med Chem 48:4754-64 (2005)  
Target
Name:
3-beta-hydroxysteroid-Delta(8),Delta(7)-isomerase
Synonyms:
3-beta-hydroxysteroid-Delta(8),Delta(7)-isomerase/Delta(24)-sterol reductase Anti-estrogen binding site (AEBS) D8-D7 sterol isomerase EBP Emopamil-binding protein
Type:
PROTEIN
Mol. Mass.:
26358.51
Organism:
Homo sapiens (Human)
Description:
ChEMBL_873432
Residue:
230
  
Inhibitor
Name:
BDBM50170658
Synonyms:
4a,5',6a,7-tetramethyl-(2S,4aS,4bS,6aS,6bR,7S,8'S,9aS,10aS,10bR,12aS)-spiro[perhydronaphtho[2',1':4,5]indeno[2,1-b]furan-8,2'-(4'H,5'H,6'H-pyridine)]-2-ol | CHEMBL365417
Type:
Small organic molecule
Emp. Form.:
C27H45NO2
Mol. Mass.:
415.6517
SMILES:
C[C@H]1[C@H]2[C@H](C[C@H]3[C@@H]4CC[C@H]5C[C@@H](O)CC[C@]5(C)[C@H]4CC[C@]23C)O[C@@]11CCC(C)CN1
: