Target
3-beta-hydroxysteroid-Delta(8),Delta(7)-isomerase
Ligand
BDBM50170648
Substrate
Meas. Tech.
ChEMBL_303691 (CHEMBL829736)
Ki
6±n/a nM
Citation
 Laggner, CSchieferer, CFiechtner, BPoles, GHoffmann, RDGlossmann, HLanger, TMoebius, FF Discovery of high-affinity ligands of sigma1 receptor, ERG2, and emopamil binding protein by pharmacophore modeling and virtual screening. J Med Chem 48:4754-64 (2005)  
Target
Name:
3-beta-hydroxysteroid-Delta(8),Delta(7)-isomerase
Synonyms:
3-beta-hydroxysteroid-Delta(8),Delta(7)-isomerase/Delta(24)-sterol reductase Anti-estrogen binding site (AEBS) D8-D7 sterol isomerase EBP Emopamil-binding protein
Type:
PROTEIN
Mol. Mass.:
26358.51
Organism:
Homo sapiens (Human)
Description:
ChEMBL_873432
Residue:
230
  
Inhibitor
Name:
BDBM50170648
Synonyms:
(R)-2-Isopropyl-5-(methyl-phenethyl-amino)-2-phenyl-pentanenitrile | CHEMBL187615
Type:
Small organic molecule
Emp. Form.:
C23H30N2
Mol. Mass.:
334.4977
SMILES:
CC(C)[C@@](CCCN(C)CCc1ccccc1)(C#N)c1ccccc1
: