Target
3-beta-hydroxysteroid-Delta(8),Delta(7)-isomerase
Ligand
BDBM50170660
Substrate
Meas. Tech.
ChEMBL_303691 (CHEMBL829736)
Ki
15±n/a nM
Citation
 Laggner, CSchieferer, CFiechtner, BPoles, GHoffmann, RDGlossmann, HLanger, TMoebius, FF Discovery of high-affinity ligands of sigma1 receptor, ERG2, and emopamil binding protein by pharmacophore modeling and virtual screening. J Med Chem 48:4754-64 (2005)  
Target
Name:
3-beta-hydroxysteroid-Delta(8),Delta(7)-isomerase
Synonyms:
3-beta-hydroxysteroid-Delta(8),Delta(7)-isomerase/Delta(24)-sterol reductase Anti-estrogen binding site (AEBS) D8-D7 sterol isomerase EBP Emopamil-binding protein
Type:
PROTEIN
Mol. Mass.:
26358.51
Organism:
Homo sapiens (Human)
Description:
ChEMBL_873432
Residue:
230
  
Inhibitor
Name:
BDBM50170660
Synonyms:
CHEMBL190883 N,N-dipropyl-2-[4-methoxy-3-(2-phenylethoxy)phenyl]ethylamine NE-100 | [2-(4-Methoxy-3-phenethyloxy-phenyl)-ethyl]-dipropyl-amine
Type:
Small organic molecule
Emp. Form.:
C23H33NO2
Mol. Mass.:
355.5136
SMILES:
CCCN(CCC)CCc1ccc(OC)c(OCCc2ccccc2)c1
: