Target
3-beta-hydroxysteroid-Delta(8),Delta(7)-isomerase
Ligand
BDBM50170646
Substrate
Meas. Tech.
ChEMBL_303691 (CHEMBL829736)
Ki
34000±n/a nM
Citation
 Laggner, CSchieferer, CFiechtner, BPoles, GHoffmann, RDGlossmann, HLanger, TMoebius, FF Discovery of high-affinity ligands of sigma1 receptor, ERG2, and emopamil binding protein by pharmacophore modeling and virtual screening. J Med Chem 48:4754-64 (2005)  
Target
Name:
3-beta-hydroxysteroid-Delta(8),Delta(7)-isomerase
Synonyms:
3-beta-hydroxysteroid-Delta(8),Delta(7)-isomerase/Delta(24)-sterol reductase Anti-estrogen binding site (AEBS) D8-D7 sterol isomerase EBP Emopamil-binding protein
Type:
PROTEIN
Mol. Mass.:
26358.51
Organism:
Homo sapiens (Human)
Description:
ChEMBL_873432
Residue:
230
  
Inhibitor
Name:
BDBM50170646
Synonyms:
4-(2-{4-[(E)-3-(4-Chloro-phenyl)-allyl]-piperazin-1-yl}-ethyl)-benzoic acid CHEMBL2172263
Type:
Small organic molecule
Emp. Form.:
C22H25ClN2O2
Mol. Mass.:
384.899
SMILES:
OC(=O)c1ccc(CCN2CCN(C\C=C\c3ccc(Cl)cc3)CC2)cc1
: