Target
3-beta-hydroxysteroid-Delta(8),Delta(7)-isomerase
Ligand
BDBM50047016
Substrate
Meas. Tech.
ChEMBL_303691 (CHEMBL829736)
Ki
165±n/a nM
Citation
 Laggner, CSchieferer, CFiechtner, BPoles, GHoffmann, RDGlossmann, HLanger, TMoebius, FF Discovery of high-affinity ligands of sigma1 receptor, ERG2, and emopamil binding protein by pharmacophore modeling and virtual screening. J Med Chem 48:4754-64 (2005)  
Target
Name:
3-beta-hydroxysteroid-Delta(8),Delta(7)-isomerase
Synonyms:
3-beta-hydroxysteroid-Delta(8),Delta(7)-isomerase/Delta(24)-sterol reductase Anti-estrogen binding site (AEBS) D8-D7 sterol isomerase EBP Emopamil-binding protein
Type:
PROTEIN
Mol. Mass.:
26358.51
Organism:
Homo sapiens (Human)
Description:
ChEMBL_873432
Residue:
230
  
Inhibitor
Name:
BDBM50047016
Synonyms:
1-(4-Fluoro-phenyl)-4-[4-hydroxy-4-(3-trifluoromethyl-phenyl)-piperidin-1-yl]-butan-1-one CHEMBL15023 | Trifluperidol
Type:
Small organic molecule
Emp. Form.:
C22H23F4NO2
Mol. Mass.:
409.4171
SMILES:
OC1(CCN(CCCC(=O)c2ccc(F)cc2)CC1)c1cccc(c1)C(F)(F)F
: