Target
3-beta-hydroxysteroid-Delta(8),Delta(7)-isomerase
Ligand
BDBM50013260
Substrate
Meas. Tech.
ChEMBL_303691 (CHEMBL829736)
Ki
8500±n/a nM
Citation
 Laggner, CSchieferer, CFiechtner, BPoles, GHoffmann, RDGlossmann, HLanger, TMoebius, FF Discovery of high-affinity ligands of sigma1 receptor, ERG2, and emopamil binding protein by pharmacophore modeling and virtual screening. J Med Chem 48:4754-64 (2005)  
Target
Name:
3-beta-hydroxysteroid-Delta(8),Delta(7)-isomerase
Synonyms:
3-beta-hydroxysteroid-Delta(8),Delta(7)-isomerase/Delta(24)-sterol reductase Anti-estrogen binding site (AEBS) D8-D7 sterol isomerase EBP Emopamil-binding protein
Type:
PROTEIN
Mol. Mass.:
26358.51
Organism:
Homo sapiens (Human)
Description:
ChEMBL_873432
Residue:
230
  
Inhibitor
Name:
BDBM50013260
Synonyms:
CHEMBL345754 N-Benzyl-N'-[4-(1H-indol-2-yl)-thiazol-2-yl]-guanidine : (Hydrobromide)
Type:
Small organic molecule
Emp. Form.:
C19H17N5S
Mol. Mass.:
347.437
SMILES:
NC(NCc1ccccc1)=Nc1nc(cs1)-c1cc2ccccc2[nH]1
: