Target
Cannabinoid receptor 1
Ligand
BDBM22988
Substrate
Meas. Tech.
ChEMBL_302526 (CHEMBL827379)
Ki
50±n/a nM
Citation
 Lambert, DMFowler, CJ The endocannabinoid system: drug targets, lead compounds, and potential therapeutic applications. J Med Chem 48:5059-87 (2005)  
Target
Name:
Cannabinoid receptor 1
Synonyms:
CANN6 CB-R CNR CNR1_HUMAN Cannabinoid receptor Cannabinoid receptor 1 (brain)
Type:
G Protein-Coupled Receptor (GPCR)
Mol. Mass.:
52868.96
Organism:
Homo sapiens (Human)
Description:
P21554
Residue:
472
  
Inhibitor
Name:
BDBM22988
Synonyms:
(5Z,8Z,11Z,14Z)-N-(2-hydroxyethyl)icosa-5,8,11,14-tetraenamide ANANDAMIDE Arachidonoyl ethanolamide (AEA) Arachidonylethanolamide [14C]Anandamide | [3H]Anandamide
Type:
radiolabeled substrate
Emp. Form.:
C22H37NO2
Mol. Mass.:
347.5347
SMILES:
CCCCC\C=C/C\C=C/C\C=C/C\C=C/CCCC(=O)NCCO
: