Target
Cytochrome P450 2A6
Ligand
BDBM50159262
Substrate
Meas. Tech.
ChEMBL_305266 (CHEMBL832816)
IC50
25000±n/a nM
Citation
 Rahnasto, MRaunio, HPoso, AWittekindt, CJuvonen, RO Quantitative structure-activity relationship analysis of inhibitors of the nicotine metabolizing CYP2A6 enzyme. J Med Chem 48:440-9 (2005)  
Target
Name:
Cytochrome P450 2A6
Synonyms:
1,4-cineole 2-exo-monooxygenase CP2A6_HUMAN CYP2A6 Coumarin 7-hydroxylase Cytochrome P450 IIA3 | Cytochrome P450(I)
Type:
Protein
Mol. Mass.:
56514.34
Organism:
Homo sapiens (Human)
Description:
P11509
Residue:
494
  
Inhibitor
Name:
BDBM50159262
Synonyms:
3-Methyl-isoquinoline CHEMBL191667
Type:
Small organic molecule
Emp. Form.:
C10H9N
Mol. Mass.:
143.1852
SMILES:
Cc1cc2ccccc2cn1
: