Target
Acetylcholinesterase
Ligand
BDBM10958
Substrate
Meas. Tech.
ChEMBL_305786 (CHEMBL874440)
IC50
22±n/a nM
Citation
 Luo, WYu, QSZhan, MParrish, DDeschamps, JRKulkarni, SSHolloway, HWAlley, GMLahiri, DKBrossi, AGreig, NH Novel anticholinesterases based on the molecular skeletons of furobenzofuran and methanobenzodioxepine. J Med Chem 48:986-94 (2005)  
Target
Name:
Acetylcholinesterase
Synonyms:
ACES_HUMAN Acetylcholinesterase (AChE) | Acetylcholinesterase (human AChE)
Type:
Enzyme
Mol. Mass.:
67792.70
Organism:
Homo sapiens (Human)
Description:
P22303
Residue:
614
  
Inhibitor
Name:
BDBM10958
Synonyms:
(3aS,8aR)-1,3a,8-trimethyl-1H,2H,3H,3aH,8H,8aH-pyrrolo[2,3-b]indol-5-yl N-phenylcarbamate US10864192, Compound (-)-Phenserine phenserine.tartaric acid
Type:
Small organic molecule
Emp. Form.:
C20H23N3O2
Mol. Mass.:
337.4155
SMILES:
[H][C@]12N(C)CC[C@@]1(C)c1cc(OC(=O)Nc3ccccc3)ccc1N2C
: