Target
Sodium-dependent dopamine transporter
Ligand
BDBM50026752
Substrate
Meas. Tech.
ChEMBL_302722 (CHEMBL839593)
Ki
17800±n/a nM
Citation
 Lomenzo, SARhoden, JBIzenwasser, SWade, DKopajtic, TKatz, JLTrudell, ML Synthesis and biological evaluation of meperidine analogues at monoamine transporters. J Med Chem 48:1336-43 (2005)  
Target
Name:
Sodium-dependent dopamine transporter
Synonyms:
DA transporter SC6A3_RAT Sodium-dependent dopamine transporter | Sodium-dependent dopamine transporter (DAT)
Type:
Multi-pass membrane protein
Mol. Mass.:
68749.45
Organism:
Rattus norvegicus (rat)
Description:
P23977
Residue:
619
  
Inhibitor
Name:
BDBM50026752
Synonyms:
1-Methyl-4-phenyl-piperidine-4-carboxylic acid ethyl ester 4-Ethoxycarbonyl-1-methyl-4-phenyl-piperidinium Demerol MEPERIDINE HYDROCHLORIDE Pethidine | ethyl 1-methyl-4-phenylpiperidine-4-carboxylate
Type:
Small organic molecule
Emp. Form.:
C15H21NO2
Mol. Mass.:
247.3327
SMILES:
CCOC(=O)C1(CCN(C)CC1)c1ccccc1
: