Target
Mu-type opioid receptor
Ligand
BDBM50083536
Substrate
Meas. Tech.
ChEMBL_302547 (CHEMBL827398)
Ki
2040±n/a nM
Citation
 Lomenzo, SARhoden, JBIzenwasser, SWade, DKopajtic, TKatz, JLTrudell, ML Synthesis and biological evaluation of meperidine analogues at monoamine transporters. J Med Chem 48:1336-43 (2005)  
Target
Name:
Mu-type opioid receptor
Synonyms:
M-OR-1 MOR-1 MUOR1 Mu opiate receptor OPRM1 hMOP | mu-type opioid receptor isoform MOR-1
Type:
G Protein-Coupled Receptor (GPCR)
Mol. Mass.:
44789.51
Organism:
Homo sapiens (Human)
Description:
P35372
Residue:
400
  
Inhibitor
Name:
BDBM50083536
Synonyms:
4-(3,4-Dichloro-phenyl)-1-methyl-piperidine-4-carboxylic acid ethyl ester CHEMBL541124
Type:
Small organic molecule
Emp. Form.:
C15H19Cl2NO2
Mol. Mass.:
316.223
SMILES:
CCOC(=O)C1(CCN(C)CC1)c1ccc(Cl)c(Cl)c1
: