Target
Transporter
Ligand
BDBM50083530
Substrate
Meas. Tech.
ChEMBL_302810 (CHEMBL838518)
Ki
519300±n/a nM
Citation
 Lomenzo, SARhoden, JBIzenwasser, SWade, DKopajtic, TKatz, JLTrudell, ML Synthesis and biological evaluation of meperidine analogues at monoamine transporters. J Med Chem 48:1336-43 (2005)  
Target
Name:
Transporter
Synonyms:
Monoamine transporters; Norepininephrine & dopamine | Norepinephrine Monoamine transporters
Type:
PROTEIN
Mol. Mass.:
66787.87
Organism:
Rattus norvegicus
Description:
ChEMBL_1463061
Residue:
597
  
Inhibitor
Name:
BDBM50083530
Synonyms:
4-(4-Iodo-phenyl)-1-methyl-piperidine-4-carboxylic acid ethyl ester CHEMBL536264
Type:
Small organic molecule
Emp. Form.:
C15H20INO2
Mol. Mass.:
373.2293
SMILES:
CCOC(=O)C1(CCN(C)CC1)c1ccc(I)cc1
: