Target
Metabotropic glutamate receptor 1
Ligand
BDBM50163616
Substrate
Meas. Tech.
ChEMBL_305830 (CHEMBL829572)
IC50
5±n/a nM
Citation
 Mabire, DCoupa, SAdelinet, CPoncelet, ASimonnet, YVenet, MWouters, RLesage, ASVan Beijsterveldt, LBischoff, F Synthesis, structure-activity relationship, and receptor pharmacology of a new series of quinoline derivatives acting as selective, noncompetitive mGlu1 antagonists. J Med Chem 48:2134-53 (2005)  
Target
Name:
Metabotropic glutamate receptor 1
Synonyms:
GRM1_RAT Grm1 Metabotropic glutamate receptor Mglur1 metabotropic glutamate 1/5-D metabotropic glutamate receptor 1 isoform alpha precursor
Type:
Enzyme Catalytic Domain
Mol. Mass.:
133240.47
Organism:
RAT
Description:
metabotropic glutamate 1/2 0 RAT::P23385
Residue:
1199
  
Inhibitor
Name:
BDBM50163616
Synonyms:
(2-Chloro-3-ethyl-quinolin-6-yl)-(4-methoxy-cyclohexyl)-methanone | CHEMBL178592
Type:
Small organic molecule
Emp. Form.:
C19H22ClNO2
Mol. Mass.:
331.836
SMILES:
CCc1cc2cc(ccc2nc1Cl)C(=O)C1CCC(CC1)OC
: