Target
Polyprenyl synthetase family protein
Ligand
BDBM12581
Substrate
Meas. Tech.
ChEMBL_302625 (CHEMBL839917)
Ki
190±n/a nM
Citation
 Sanders, JMSong, YChan, JMZhang, YJennings, SKosztowski, TOdeh, SFlessner, RSchwerdtfeger, CKotsikorou, EMeints, GAGómez, AOGonzález-Pacanowska, DRaker, AMWang, Hvan Beek, ERPapapoulos, SEMorita, CTOldfield, E Pyridinium-1-yl bisphosphonates are potent inhibitors of farnesyl diphosphate synthase and bone resorption. J Med Chem 48:2957-63 (2005)  
Target
Name:
Polyprenyl synthetase family protein
Synonyms:
Farnesyl diphosphate synthase | Farnesyl pyrophosphate synthase
Type:
PROTEIN
Mol. Mass.:
41078.35
Organism:
Plasmodium falciparum (isolate 3D7)
Description:
ChEMBL_330072
Residue:
362
  
Inhibitor
Name:
BDBM12581
Synonyms:
(3-amino-1-hydroxy-1-phosphonopropyl)phosphonic acid CHEMBL834 | JMC515594 Compound 62
Type:
Small organic molecule
Emp. Form.:
C3H11NO7P2
Mol. Mass.:
235.0695
SMILES:
NCCC(O)(P(O)(O)=O)P(O)(O)=O
: