Target
Ileal sodium/bile acid cotransporter
Ligand
BDBM50172668
Substrate
Meas. Tech.
ChEMBL_321562 (CHEMBL882493)
IC50
1±n/a nM
Citation
 Huang, HCTremont, SJLee, LFKeller, BTCarpenter, AJWang, CCBanerjee, SCBoth, SRFletcher, TGarland, DJHuang, WJones, CKoeller, KJKolodziej, SALi, JManning, REMahoney, MWMiller, REMischke, DARath, NPReinhard, EJTollefson, MBVernier, WFWagner, GMRapp, SRBeaudry, JGlenn, KRegina, KSchuh, JRSmith, METrivedi, JSReitz, DB Discovery of potent, nonsystemic apical sodium-codependent bile acid transporter inhibitors (Part 2). J Med Chem 48:5853-68 (2005)  
Target
Name:
Ileal sodium/bile acid cotransporter
Synonyms:
ASBT IBAT Ileal Na(+)/bile acid cotransporter Ileal bile acid transporter/bile acid cotransporter NTCP2 SLC10A2
Type:
Enzyme
Mol. Mass.:
37714.89
Organism:
Homo sapiens (Human)
Description:
SLC10A2
Residue:
348
  
Inhibitor
Name:
BDBM50172668
Synonyms:
1-{4-[4-((4R,5R)-3,3-Dibutyl-7-dimethylamino-4-hydroxy-1,1-dioxo-2,3,4,5-tetrahydro-1H-1lambda*6*-benzo[b]thiepin-5-yl)-phenoxymethyl]-benzyl}-pyridinium | CHEMBL195012
Type:
Small organic molecule
Emp. Form.:
C39H49N2O4S
Mol. Mass.:
641.882
SMILES:
CCCCC1(CCCC)CS(=O)(=O)c2ccc(cc2[C@H]([C@H]1O)c1ccc(OCc2ccc(C[n+]3ccccc3)cc2)cc1)N(C)C
: