Target
Guanine nucleotide-binding protein G(i) subunit alpha-3
Ligand
BDBM50174653
Substrate
Meas. Tech.
ChEMBL_321105 (CHEMBL882871)
EC50
12100±n/a nM
Citation
 Manetti, DDi Cesare Mannelli, LDei, SGaleotti, NGhelardini, CRomanelli, MNScapecchi, STeodori, EPacini, ABartolini, AGualtieri, F Design, synthesis, and preliminary pharmacological evaluation of a set of small molecules that directly activate gi proteins. J Med Chem 48:6491-503 (2005)  
Target
Name:
Guanine nucleotide-binding protein G(i) subunit alpha-3
Synonyms:
GNAI3 Guanine nucleotide-binding protein G(k), alpha-3 subunit
Type:
PROTEIN
Mol. Mass.:
40527.21
Organism:
Homo sapiens (Human)
Description:
ChEMBL_321105
Residue:
354
  
Inhibitor
Name:
BDBM50174653
Synonyms:
1-[4,4']Bipiperidinyl-1-yl-tridecan-1-one; hydrochloride | CHEMBL558775
Type:
Small organic molecule
Emp. Form.:
C23H44N2O
Mol. Mass.:
364.6083
SMILES:
CCCCCCCCCCCCC(=O)N1CCC(CC1)C1CCNCC1
: