Target
Adenosine receptor A1
Ligand
BDBM21214
Substrate
Meas. Tech.
ChEMBL_325560 (CHEMBL860279)
Ki
3336±n/a nM
Citation
 Novellino, ECosimelli, BEhlardo, MGreco, GIadanza, MLavecchia, ARimoli, MGSala, ADa Settimo, APrimofiore, GDa Settimo, FTaliani, SLa Motta, CKlotz, KNTuscano, DTrincavelli, MLMartini, C 2-(Benzimidazol-2-yl)quinoxalines: a novel class of selective antagonists at human A(1) and A(3) adenosine receptors designed by 3D database searching. J Med Chem 48:8253-60 (2005)  
Target
Name:
Adenosine receptor A1
Synonyms:
A1 adenosine receptor (hA1) AA1R_HUMAN ADORA1 Adenosine A1-receptor Adenosine receptor A1 (hA1) | Adenosine transporter (AdT)
Type:
G Protein-Coupled Receptor (GPCR)
Mol. Mass.:
36520.92
Organism:
Homo sapiens (Human)
Description:
P30542
Residue:
326
  
Inhibitor
Name:
BDBM21214
Synonyms:
3-(3-chloro-1H-pyrazol-5-yl)-1,2-dihydroquinoxalin-2-one CHEMBL403521 | pyrazole-quinoxalinone, B
Type:
Small organic molecule
Emp. Form.:
C11H7ClN4O
Mol. Mass.:
246.652
SMILES:
Clc1cc(n[nH]1)-c1nc2ccccc2[nH]c1=O
: