Target
Carbonic anhydrase 1
Ligand
BDBM50098106
Substrate
Meas. Tech.
ChEMBL_326094 (CHEMBL869401)
Ki
2.1±n/a nM
Citation
 Cecchi, ATaylor, SDLiu, YHill, BVullo, DScozzafava, ASupuran, CT Carbonic anhydrase inhibitors: inhibition of the human isozymes I, II, VA, and IX with a library of substituted difluoromethanesulfonamides. Bioorg Med Chem Lett 15:5192-6 (2005)  
Target
Name:
Carbonic anhydrase 1
Synonyms:
CA-I CAB Carbonate dehydratase I Carbonic anhydrase 1 (CA I) Carbonic anhydrase 1 (Recombinant CA I) Carbonic anhydrase B Carbonic anhydrase I (CA I) Carbonic anhydrase I (CAI) Carbonic anhydrase isoenzyme I (hCA I) | hCA
Type:
Enzyme
Mol. Mass.:
28873.37
Organism:
Homo sapiens (Human)
Description:
P00915
Residue:
261
  
Inhibitor
Name:
BDBM50098106
Synonyms:
CHEMBL24259 Sulfamic acid phenyl ester | phenyl sulfamate
Type:
Small organic molecule
Emp. Form.:
C6H7NO3S
Mol. Mass.:
173.19
SMILES:
NS(=O)(=O)Oc1ccccc1
: