Target
Vasopressin V1b receptor
Ligand
BDBM50178153
Substrate
Meas. Tech.
ChEMBL_326555 (CHEMBL860334)
Ki
>10000±n/a nM
Citation
 Quattropani, ADorbais, JCovini, DPittet, PAColovray, VThomas, RJCoxhead, RHalazy, SScheer, AMissotten, MAyala, GBradshaw, CDe Raemy-Schenk, AMNichols, ACirillo, RTos, EGGiachetti, CGolzio, LMarinelli, PChurch, DJBarberis, CChollet, ASchwarz, MK Discovery and development of a new class of potent, selective, orally active oxytocin receptor antagonists. J Med Chem 48:7882-905 (2005)  
Target
Name:
Vasopressin V1b receptor
Synonyms:
AVPR V1b AVPR1B Antidiuretic hormone receptor 1b V1bR VPR3 Vasopressin V1b receptor (V1b) Vasopressin V3 receptor
Type:
Enzyme
Mol. Mass.:
46985.01
Organism:
Homo sapiens (Human)
Description:
P47901
Residue:
424
  
Inhibitor
Name:
BDBM50178153
Synonyms:
4-ethoxy-N-(4-methylphenyl)-N-{2-oxo-2-[2-(2-oxo-1,2-dihydro-3H-indol-3-ylidene)hydrazino]ethyl}benzenesulfonamide | CHEMBL199623
Type:
Small organic molecule
Emp. Form.:
C25H26N4O5S
Mol. Mass.:
494.563
SMILES:
CCOc1ccc(cc1)S(=O)(=O)N(CC(=O)NN=C1C(=O)NC2C=CCC=C12)c1ccc(C)cc1
: