Target
Vasopressin V1a receptor
Ligand
BDBM50178176
Substrate
Meas. Tech.
ChEMBL_326539 (CHEMBL863357)
Ki
115±n/a nM
Citation
 Quattropani, ADorbais, JCovini, DPittet, PAColovray, VThomas, RJCoxhead, RHalazy, SScheer, AMissotten, MAyala, GBradshaw, CDe Raemy-Schenk, AMNichols, ACirillo, RTos, EGGiachetti, CGolzio, LMarinelli, PChurch, DJBarberis, CChollet, ASchwarz, MK Discovery and development of a new class of potent, selective, orally active oxytocin receptor antagonists. J Med Chem 48:7882-905 (2005)  
Target
Name:
Vasopressin V1a receptor
Synonyms:
AVPR V1a AVPR1A V1AR_HUMAN VASOPRESSIN V1A Vasopressin V1 receptor Vasopressin receptor
Type:
Receptor
Mol. Mass.:
46820.18
Organism:
Homo sapiens (Human)
Description:
P37288
Residue:
418
  
Inhibitor
Name:
BDBM50178176
Synonyms:
CHEMBL373167 | N-(2-(3,4-dihydroisoquinolin-2(1H)-yl)-2-oxoethyl)-N-(4-methoxyphenyl)benzenesulfonamide
Type:
Small organic molecule
Emp. Form.:
C24H24N2O4S
Mol. Mass.:
436.523
SMILES:
COc1ccc(cc1)N(CC(=O)N1CCc2ccccc2C1)S(=O)(=O)c1ccccc1
: