Target
Muscarinic acetylcholine receptor M3
Ligand
BDBM50176711
Substrate
Meas. Tech.
ChEMBL_327855 (CHEMBL863985)
Ki
0.79±n/a nM
Citation
 Starck, JPTalaga, PQuéré, LCollart, PChristophe, BLo Brutto, PJadot, SChimmanamada, DZanda, MWagner, AMioskowski, CMassingham, RGuyaux, M Potent anti-muscarinic activity in a novel series of quinuclidine derivatives. Bioorg Med Chem Lett 16:373-7 (2005)  
Target
Name:
Muscarinic acetylcholine receptor M3
Synonyms:
ACM3_HUMAN Cholinergic, muscarinic M3 Muscarinic receptor M3 | RecName: Full=Muscarinic acetylcholine receptor M3
Type:
Enzyme
Mol. Mass.:
66151.03
Organism:
Homo sapiens (Human)
Description:
P20309
Residue:
590
  
Inhibitor
Name:
BDBM50176711
Synonyms:
(R)-1,1-bis(3-fluorophenyl)-3-(3-methoxyquinuclidin-3-yl)prop-2-yn-1-ol | CHEMBL383389
Type:
Small organic molecule
Emp. Form.:
C23H23F2NO2
Mol. Mass.:
383.431
SMILES:
CO[C@@]1(CN2CCC1CC2)C#CC(O)(c1cccc(F)c1)c1cccc(F)c1
: