Target
Sterol O-acyltransferase 1
Ligand
BDBM50175775
Substrate
Meas. Tech.
ChEMBL_328123 (CHEMBL863930)
IC50
43±n/a nM
Citation
 Ban, HMuraoka, MIoriya, KOhashi, N Synthesis and biological activity of novel 4-phenyl-1,8-naphthyridin-2(1H)-on-3-yl ureas: potent acyl-CoA:cholesterol acyltransferase inhibitor with improved aqueous solubility. Bioorg Med Chem Lett 16:44-8 (2005)  
Target
Name:
Sterol O-acyltransferase 1
Synonyms:
ACAT-1 Acat SOAT1_RAT Sterol O-acyltransferase, Soat
Type:
PROTEIN
Mol. Mass.:
64165.56
Organism:
Rattus norvegicus
Description:
ChEMBL_28796
Residue:
545
  
Inhibitor
Name:
BDBM50175775
Synonyms:
1-(3-amino-2,6-diisopropylphenyl)-3-(1-butyl-4-(3-(3-hydroxypropoxy)phenyl)-2-oxo-1,2-dihydro-1,8-naphthyridin-3-yl)urea hydrochloride | CHEMBL538824
Type:
Small organic molecule
Emp. Form.:
C34H43N5O4
Mol. Mass.:
585.7363
SMILES:
CCCCn1c2ncccc2c(-c2cccc(OCCCO)c2)c(NC(=O)Nc2c(ccc(N)c2C(C)C)C(C)C)c1=O
: