Target
Prothrombin
Ligand
BDBM50177418
Substrate
Meas. Tech.
ChEMBL_334615 (CHEMBL862522)
IC50
190±n/a nM
Citation
 Hanessian, STherrien, Evan Otterlo, WABayrakdarian, MNilsson, IFjellström, OXue, Y Phenolic P2/P3 core motif as thrombin inhibitors--design, synthesis, and X-ray co-crystal structure. Bioorg Med Chem Lett 16:1032-6 (2006)  
Target
Name:
Prothrombin
Synonyms:
Activation peptide fragment 1 Coagulation factor II Prothrombin precursor Thrombin heavy chain | Thrombin light chain
Type:
Protein
Mol. Mass.:
70029.57
Organism:
Homo sapiens (Human)
Description:
P00734
Residue:
622
  
Inhibitor
Name:
BDBM50177418
Synonyms:
CHEMBL556953 | N-((6-amino-2-methylpyridin-3-yl)methyl)-2-(3-(3-chloro-2-methylphenylsulfonamido)-2-hydroxy-6-methylphenyl)acetamide hydrochloride
Type:
Small organic molecule
Emp. Form.:
C23H25ClN4O4S
Mol. Mass.:
488.987
SMILES:
Cc1ccc(NS(=O)(=O)c2cccc(Cl)c2C)c(O)c1CC(=O)NCc1ccc(N)nc1C
: