Target
Carbonic anhydrase
Ligand
BDBM11638
Substrate
Meas. Tech.
ChEMBL_347177 (CHEMBL862664)
Ki
179±n/a nM
Citation
 Nishimori, IVullo, DMinakuchi, TMorimoto, KOnishi, SScozzafava, ASupuran, CT Carbonic anhydrase inhibitors: cloning and sulfonamide inhibition studies of a carboxyterminal truncated alpha-carbonic anhydrase from Helicobacter pylori. Bioorg Med Chem Lett 16:2182-8 (2006)  
Target
Name:
Carbonic anhydrase
Synonyms:
Beta-carbonic anhydrase Carbonic anhydrase 1 hpβCA
Type:
Protein
Mol. Mass.:
25517.77
Organism:
Helicobacter pylori (strain G27)
Description:
O24855
Residue:
221
  
Inhibitor
Name:
BDBM11638
Synonyms:
CHEMBL26 N-[(1-ethylpyrrolidin-2-yl)methyl]-2-methoxy-5-sulfamoylbenzamide SULPIRIDE,(-) Sulpiride, SLP US10172837, Sulpiride
Type:
Small organic molecule
Emp. Form.:
C15H23N3O4S
Mol. Mass.:
341.426
SMILES:
CCN1CCCC1CNC(=O)c1cc(ccc1OC)S(N)(=O)=O
: