Target
Falcipain 2B
Ligand
BDBM50187252
Substrate
Meas. Tech.
ChEMBL_356421 (CHEMBL867545)
IC50
19790±n/a nM
Citation
 Micale, NKozikowski, APEttari, RGrasso, SZappalà, MJeong, JJKumar, AHanspal, MChishti, AH Novel peptidomimetic cysteine protease inhibitors as potential antimalarial agents. J Med Chem 49:3064-7 (2006)  
Target
Name:
Falcipain 2B
Synonyms:
Type:
PROTEIN
Mol. Mass.:
27119.28
Organism:
Plasmodium falciparum
Description:
ChEMBL_356421
Residue:
241
  
Inhibitor
Name:
BDBM50187252
Synonyms:
CHEMBL377557 | phenyl-carbamic acid 1-[(2-hydroxy-5-oxo-tetrahydro-furan-3(S)-ylcarbamoyl)-methyl]-2-oxo-5-phenyl-2,3-dihydro-1H-benzo[e][1,4]diazepin-3(R)-ylmethyl ester
Type:
Small organic molecule
Emp. Form.:
C29H26N4O7
Mol. Mass.:
542.5393
SMILES:
OC1OC(=O)C[C@@H]1NC(=O)CN1c2ccccc2C(=N[C@H](COC(=O)Nc2ccccc2)C1=O)c1ccccc1
: