Target
Androgen receptor
Ligand
BDBM50185191
Substrate
Meas. Tech.
ChEMBL_359728 (CHEMBL869334)
IC50
130±n/a nM
Citation
 Zhang, XLi, XAllan, GFMusto, ALundeen, SGSui, Z Discovery of indole-containing tetracycles as a new scaffold for androgen receptor ligands. Bioorg Med Chem Lett 16:3233-7 (2006)  
Target
Name:
Androgen receptor
Synonyms:
ANDR_RAT Ar Nr3c4 | androgen
Type:
Enzyme
Mol. Mass.:
98219.08
Organism:
Rattus norvegicus (Rat)
Description:
P15207
Residue:
902
  
Inhibitor
Name:
BDBM50185191
Synonyms:
11-methyl-6,11-dihydrothiochromeno[4,3-b]indol-9-ol | CHEMBL380133
Type:
Small organic molecule
Emp. Form.:
C16H13NOS
Mol. Mass.:
267.346
SMILES:
Cn1c-2c(CSc3ccccc-23)c2ccc(O)cc12
: