Target
Androgen receptor
Ligand
BDBM50185199
Substrate
Meas. Tech.
ChEMBL_359728 (CHEMBL869334)
IC50
930±n/a nM
Citation
 Zhang, XLi, XAllan, GFMusto, ALundeen, SGSui, Z Discovery of indole-containing tetracycles as a new scaffold for androgen receptor ligands. Bioorg Med Chem Lett 16:3233-7 (2006)  
Target
Name:
Androgen receptor
Synonyms:
ANDR_RAT Ar Nr3c4 | androgen
Type:
Enzyme
Mol. Mass.:
98219.08
Organism:
Rattus norvegicus (Rat)
Description:
P15207
Residue:
902
  
Inhibitor
Name:
BDBM50185199
Synonyms:
11-methyl-6,11-dihydro-5H-pyrido[4,3-a]carbazol-8-ol | CHEMBL378087
Type:
Small organic molecule
Emp. Form.:
C16H14N2O
Mol. Mass.:
250.2952
SMILES:
Cn1c-2c(CCc3cnccc-23)c2cc(O)ccc12
: