Target
Carbonic anhydrase 7
Ligand
BDBM26990
Substrate
Meas. Tech.
ChEMBL_360972 (CHEMBL860093)
Ki
1240000±n/a nM
Citation
 Vullo, DRuusuvuori, EKaila, KScozzafava, ASupuran, CT Carbonic anhydrase inhibitors: inhibition of the cytosolic human isozyme VII with anions. Bioorg Med Chem Lett 16:3139-43 (2006)  
Target
Name:
Carbonic anhydrase 7
Synonyms:
CA-VII CAH7_HUMAN Carbonic anhydrase Carbonic anhydrase VII (CA VII)
Type:
Enzyme
Mol. Mass.:
29664.11
Organism:
Homo sapiens (Human)
Description:
Human cloned isozyme.
Residue:
264
  
Inhibitor
Name:
BDBM26990
Synonyms:
CHEMBL1644699 HS(-1) hydrosulfide | sulfanide
Type:
Ion
Emp. Form.:
HS
Mol. Mass.:
33.073
SMILES:
[SH-]
: