Target
3-hydroxyacyl-[acyl-carrier-protein] dehydratase
Ligand
BDBM50236531
Substrate
Meas. Tech.
ChEMBL_361103 (CHEMBL859169)
IC50
600±n/a nM
Citation
 Tasdemir, DLack, GBrun, RRüedi, PScapozza, LPerozzo, R Inhibition of Plasmodium falciparum fatty acid biosynthesis: evaluation of FabG, FabZ, and FabI as drug targets for flavonoids. J Med Chem 49:3345-53 (2006)  
Target
Name:
3-hydroxyacyl-[acyl-carrier-protein] dehydratase
Synonyms:
Fatty acid synthase
Type:
PROTEIN
Mol. Mass.:
26222.50
Organism:
Plasmodium falciparum
Description:
ChEMBL_983601
Residue:
230
  
Inhibitor
Name:
BDBM50236531
Synonyms:
(-)-gallocatechin gallate (2S,3R)-5,7-dihydroxy-2-(3,4,5-trihydroxyphenyl)-3,4-dihydro-2H-chromen-3-yl 3,4,5-trihydroxybenzoate CHEMBL264938 gallocatechin gallate
Type:
Small organic molecule
Emp. Form.:
C22H18O11
Mol. Mass.:
458.3717
SMILES:
Oc1cc(O)c2C[C@@H](OC(=O)c3cc(O)c(O)c(O)c3)[C@@H](Oc2c1)c1cc(O)c(O)c(O)c1
: