Target
3-oxoacyl-acyl-carrier protein reductase
Ligand
BDBM50135169
Substrate
Meas. Tech.
ChEMBL_361105 (CHEMBL859171)
IC50
1000±n/a nM
Citation
 Tasdemir, DLack, GBrun, RRüedi, PScapozza, LPerozzo, R Inhibition of Plasmodium falciparum fatty acid biosynthesis: evaluation of FabG, FabZ, and FabI as drug targets for flavonoids. J Med Chem 49:3345-53 (2006)  
Target
Name:
3-oxoacyl-acyl-carrier protein reductase
Synonyms:
Type:
PROTEIN
Mol. Mass.:
33333.53
Organism:
Plasmodium falciparum
Description:
ChEMBL_675156
Residue:
301
  
Inhibitor
Name:
BDBM50135169
Synonyms:
(-)-Catechin gallate 3,4,5-Trihydroxy-benzoic acid (2S,3R)-2-(3,4-dihydroxy-phenyl)-5,7-dihydroxy-chroman-3-yl ester | CHEMBL129451
Type:
Small organic molecule
Emp. Form.:
C22H18O10
Mol. Mass.:
442.3723
SMILES:
Oc1cc(O)c2C[C@@H](OC(=O)c3cc(O)c(O)c(O)c3)[C@@H](Oc2c1)c1ccc(O)c(O)c1
: