Target
3-hydroxyacyl-[acyl-carrier-protein] dehydratase
Ligand
BDBM26658
Substrate
Meas. Tech.
ChEMBL_361103 (CHEMBL859169)
IC50
8000±n/a nM
Citation
 Tasdemir, DLack, GBrun, RRüedi, PScapozza, LPerozzo, R Inhibition of Plasmodium falciparum fatty acid biosynthesis: evaluation of FabG, FabZ, and FabI as drug targets for flavonoids. J Med Chem 49:3345-53 (2006)  
Target
Name:
3-hydroxyacyl-[acyl-carrier-protein] dehydratase
Synonyms:
Fatty acid synthase
Type:
PROTEIN
Mol. Mass.:
26222.50
Organism:
Plasmodium falciparum
Description:
ChEMBL_983601
Residue:
230
  
Inhibitor
Name:
BDBM26658
Synonyms:
2-(2,4-dihydroxyphenyl)-3,5,7-trihydroxy-1-benzopyran-4-one 2-(2,4-dihydroxyphenyl)-3,5,7-trihydroxy-chromone 2-[2,4-bis(oxidanyl)phenyl]-3,5,7-tris(oxidanyl)chromen-4-one MLS000069618 Morin (5) SMR000058259 morin
Type:
Flavonoid
Emp. Form.:
C15H10O7
Mol. Mass.:
302.2357
SMILES:
Oc1ccc(c(O)c1)-c1oc2cc(O)cc(O)c2c(=O)c1O
: