Target
2-dehydropantoate 2-reductase
Ligand
BDBM11941
Substrate
Meas. Tech.
ChEMBL_382750 (CHEMBL854529)
Ki
240000±n/a nM
Citation
 Ciulli, AWilliams, GSmith, AGBlundell, TLAbell, C Probing hot spots at protein-ligand binding sites: a fragment-based approach using biophysical methods. J Med Chem 49:4992-5000 (2006)  
Target
Name:
2-dehydropantoate 2-reductase
Synonyms:
Ketopantoate reductase apbA | panE
Type:
PROTEIN
Mol. Mass.:
33866.35
Organism:
Escherichia coli (strain K12)
Description:
ChEMBL_382751
Residue:
303
  
Inhibitor
Name:
BDBM11941
Synonyms:
2,5-ADP {[(2R,3R,4R,5R)-5-(6-amino-9H-purin-9-yl)-3-hydroxy-4-(phosphonooxy)oxolan-2-yl]methoxy}phosphonic acid
Type:
Nucleoside or nucleotide
Emp. Form.:
C10H15N5O10P2
Mol. Mass.:
427.2011
SMILES:
Nc1ncnc2n(cnc12)[C@@H]1O[C@H](COP(O)(O)=O)[C@@H](O)[C@H]1OP(O)(O)=O
: