Target
GNAT family acetyltransferase
Ligand
BDBM50193479
Substrate
Meas. Tech.
ChEMBL_385423 (CHEMBL869194)
Ki
119±n/a nM
Citation
 Gao, FYan, XShakya, TBaettig, OMAit-Mohand-Brunet, SBerghuis, AMWright, GDAuclair, K Synthesis and structure-activity relationships of truncated bisubstrate inhibitors of aminoglycoside 6'-N-acetyltransferases. J Med Chem 49:5273-81 (2006)  
Target
Name:
GNAT family acetyltransferase
Synonyms:
Aminoglycoside acetyltransferase
Type:
PROTEIN
Mol. Mass.:
21017.80
Organism:
Enterococcus durans
Description:
ChEMBL_385423
Residue:
183
  
Inhibitor
Name:
BDBM50193479
Synonyms:
CID44414949 truncated aminoglycoside-coenzyme A bisubstrate analogue 3
Type:
Small organic molecule
Emp. Form.:
C46H76N11O32P3S
Mol. Mass.:
1420.139
SMILES:
CC(C)(COP([O-])(=O)OP([O-])(=O)OC[C@H]1O[C@H]([C@H](O)[C@@H]1OP([O-])([O-])=O)n1cnc2c(N)ncnc12)[C@@H](O)C(=O)NCCC(=O)NCCSCC(=O)NC[C@H]1O[C@H](O[C@@H]2[C@@H](N)C[C@@H](N)[C@H](O[C@H]3O[C@H](CO)[C@@H](O)[C@H](O)[C@H]3O[C@@H]3O[C@H](CO)[C@@H](O)[C@H]3O)[C@H]2O)[C@H](N)[C@@H](O)[C@@H]1O
: