Target
Purine nucleoside phosphorylase
Ligand
BDBM50195590
Substrate
Meas. Tech.
ChEMBL_414098 (CHEMBL908314)
Ki
306.1±n/a nM
Citation
 Semeraro, TLossani, ABotta, MGhiron, CAlvarez, RManetti, FMugnaini, CValensin, SFocher, FCorelli, F Simplified analogues of immucillin-G retain potent human purine nucleoside phosphorylase inhibitory activity. J Med Chem 49:6037-45 (2006)  
Target
Name:
Purine nucleoside phosphorylase
Synonyms:
Inosine phosphorylase NP PNPH_HUMAN | Purine nucleoside phosphorylase (PNPase)
Type:
Enzyme
Mol. Mass.:
32119.53
Organism:
Homo sapiens (Human)
Description:
Residue:
289
  
Inhibitor
Name:
BDBM50195590
Synonyms:
2-amino-1,5-dihydro-7-[[(2S)-2-(aminomethyl)-1-pyrrolidinyl]methyl]-4H-pyrrolo[3,2-d]pyrimidin-4-one diacetate
Type:
Small organic molecule
Emp. Form.:
C12H18N6O
Mol. Mass.:
262.3109
SMILES:
NC[C@@H]1CCCN1Cc1c[nH]c2c1nc(N)[nH]c2=O
: