Target
Purine nucleoside phosphorylase
Ligand
BDBM50195589
Substrate
Meas. Tech.
ChEMBL_414098 (CHEMBL908314)
IC50
2±n/a nM
Citation
 Semeraro, TLossani, ABotta, MGhiron, CAlvarez, RManetti, FMugnaini, CValensin, SFocher, FCorelli, F Simplified analogues of immucillin-G retain potent human purine nucleoside phosphorylase inhibitory activity. J Med Chem 49:6037-45 (2006)  
Target
Name:
Purine nucleoside phosphorylase
Synonyms:
Inosine phosphorylase NP PNPH_HUMAN | Purine nucleoside phosphorylase (PNPase)
Type:
Enzyme
Mol. Mass.:
32119.53
Organism:
Homo sapiens (Human)
Description:
Residue:
289
  
Inhibitor
Name:
BDBM50195589
Synonyms:
2-amino-1,5-dihydro-7-[[(2S,4R)-2-(hydroxymethyl)-4-hydroxy-1-pyrrolidinyl]methyl]-4H-pyrrolo[3,2-d]pyrimidin-4-one | CHEMBL385263
Type:
Small organic molecule
Emp. Form.:
C12H17N5O3
Mol. Mass.:
279.2951
SMILES:
Nc1nc2c(CN3C[C@H](O)C[C@H]3CO)c[nH]c2c(=O)[nH]1
: