Target
Purine nucleoside phosphorylase
Ligand
BDBM50195587
Substrate
Meas. Tech.
ChEMBL_414098 (CHEMBL908314)
IC50
3.5±n/a nM
Citation
 Semeraro, TLossani, ABotta, MGhiron, CAlvarez, RManetti, FMugnaini, CValensin, SFocher, FCorelli, F Simplified analogues of immucillin-G retain potent human purine nucleoside phosphorylase inhibitory activity. J Med Chem 49:6037-45 (2006)  
Target
Name:
Purine nucleoside phosphorylase
Synonyms:
Inosine phosphorylase NP PNPH_HUMAN | Purine nucleoside phosphorylase (PNPase)
Type:
Enzyme
Mol. Mass.:
32119.53
Organism:
Homo sapiens (Human)
Description:
Residue:
289
  
Inhibitor
Name:
BDBM50195587
Synonyms:
1,4-DIDEOXY-4-AZA-1-(S)-(9-DEAZAHYPOXANTHIN-9-YL)-D-RIBITOL CHEMBL1213652 Immucillin-H
Type:
Small organic molecule
Emp. Form.:
C11H14N4O4
Mol. Mass.:
266.2533
SMILES:
OC[C@H]1N[C@H]([C@H](O)[C@@H]1O)c1c[nH]c2c1nc[nH]c2=O
: