Target
Cannabinoid receptor 2
Ligand
BDBM50072769
Substrate
Meas. Tech.
ChEMBL_414849 (CHEMBL855031)
Ki
120.8±n/a nM
Citation
 Manera, CBenetti, VCastelli, MPCavallini, TLazzarotti, SPibiri, FSaccomanni, GTuccinardi, TVannacci, AMartinelli, AFerrarini, PL Design, synthesis, and biological evaluation of new 1,8-naphthyridin-4(1H)-on-3-carboxamide and quinolin-4(1H)-on-3-carboxamide derivatives as CB2 selective agonists. J Med Chem 49:5947-57 (2006)  
Target
Name:
Cannabinoid receptor 2
Synonyms:
CANNABINOID CB2 CB2 Cannabinoid CB2 receptor Cannabinoid receptor 2 mCB2
Type:
Enzyme Catalytic Domain
Mol. Mass.:
38220.43
Organism:
MOUSE
Description:
P47936
Residue:
347
  
Inhibitor
Name:
BDBM50072769
Synonyms:
(5Z,8Z,11Z,14Z)-Icosa-5,8,11,14-tetraenoic acid (2-chloro-ethyl)-amide CHEMBL151167 | N-(2-chloroethyl)icosa-5,8,11,14-tetraenamide
Type:
Small organic molecule
Emp. Form.:
C22H36ClNO
Mol. Mass.:
365.98
SMILES:
CCCCC\C=C/C\C=C/C\C=C/C\C=C/CCCC(=O)NCCCl
: