Target
Bile acid receptor
Ligand
BDBM50192925
Substrate
Meas. Tech.
ChEMBL_422300 (CHEMBL906990)
IC50
25300±n/a nM
Citation
 Nam, SJKo, HShin, MHam, JChin, JKim, YKim, HShin, KChoi, HKang, H Farnesoid X-activated receptor antagonists from a marine sponge Spongia sp. Bioorg Med Chem Lett 16:5398-402 (2006)  
Target
Name:
Bile acid receptor
Synonyms:
BAR FXR HRR1 NR1H4_HUMAN RIP14 Retinoid X receptor-interacting protein 14 | farnesoid x receptor
Type:
Nuclear Receptor
Mol. Mass.:
55916.24
Organism:
Homo sapiens (Human)
Description:
Q96RI1
Residue:
486
  
Inhibitor
Name:
BDBM50192925
Synonyms:
((1R,5bS,11aS,13R,13aS,13bS)-1,13-dihydroxy-8,8,11a,13a-tetramethyl-1,3,5,5a,5b,6,7,7a,8,9,10,11,11a,11b,12,13,13a,13b-octadecahydrochryseno[2,1-c]furan-5b-yl)methyl acetate | CHEMBL216782
Type:
Small organic molecule
Emp. Form.:
C27H42O5
Mol. Mass.:
446.6194
SMILES:
CC(=O)OC[C@@]12CCC3C(C)(C)CCC[C@]3(C)C1C[C@@H](O)[C@]1(C)[C@H]3[C@H](O)OCC3=CCC21
: