Target
Cannabinoid receptor 1
Ligand
BDBM50200162
Substrate
Meas. Tech.
ChEMBL_422555 (CHEMBL911052)
Ki
>10000±n/a nM
Citation
 Murineddu, GLazzari, PRuiu, SSanna, ALoriga, GManca, IFalzoi, MDessì, CCurzu, MMChelucci, GPani, LPinna, GA Tricyclic pyrazoles. 4. Synthesis and biological evaluation of analogues of the robust and selective CB2 cannabinoid ligand 1-(2',4'-dichlorophenyl)-6-methyl-N-piperidin-1-yl-1,4-dihydroindeno[1,2-c]pyrazole-3-carboxamide. J Med Chem 49:7502-12 (2006)  
Target
Name:
Cannabinoid receptor 1
Synonyms:
Brain-type cannabinoid receptor CB-R CNR1_MOUSE Cannabinoid receptor | Cnr1
Type:
Enzyme
Mol. Mass.:
52842.52
Organism:
Mus musculus (Mouse)
Description:
P47746
Residue:
473
  
Inhibitor
Name:
BDBM50200162
Synonyms:
1-(2',4'-dichlorophenyl)-6-methyl-N-p-chlorophenyl-1,4-dihydroindeno[1,2-c]pyrazole-3-carboxamide | CHEMBL218571
Type:
Small organic molecule
Emp. Form.:
C24H16Cl3N3O
Mol. Mass.:
468.762
SMILES:
Cc1ccc-2c(Cc3c(nn(c-23)-c2ccc(Cl)cc2Cl)C(=O)Nc2ccc(Cl)cc2)c1
: