Target
Peptide deformylase 1A, chloroplastic/mitochondrial
Ligand
BDBM50201883
Substrate
Meas. Tech.
ChEMBL_423228 (CHEMBL912247)
IC50
>1000000±n/a nM
Citation
 Boularot, AGiglione, CPetit, SDuroc, YAlves de Sousa, RLarue, VCresteil, TDardel, FArtaud, IMeinnel, T Discovery and refinement of a new structural class of potent peptide deformylase inhibitors. J Med Chem 50:10-20 (2007)  
Target
Name:
Peptide deformylase 1A, chloroplastic/mitochondrial
Synonyms:
AtDEF1 DEF1 PDF 1A Peptide deformylase 1A, chloroplastic | Polypeptide deformylase
Type:
PROTEIN
Mol. Mass.:
30001.50
Organism:
Arabidopsis thaliana
Description:
ChEMBL_423228
Residue:
269
  
Inhibitor
Name:
BDBM50201883
Synonyms:
(indol-3-yl)acetic acid 2-(indol-3-yl)ethanoic acid Acid, 6 IAA heteroauxin | indole-3-acetic acid
Type:
Small organic molecule
Emp. Form.:
C10H9NO2
Mol. Mass.:
175.184
SMILES:
OC(=O)Cc1c[nH]c2ccccc12
: