Target
Peptide deformylase 1A, chloroplastic/mitochondrial
Ligand
BDBM50201888
Substrate
Meas. Tech.
ChEMBL_423228 (CHEMBL912247)
IC50
83000±n/a nM
Citation
 Boularot, AGiglione, CPetit, SDuroc, YAlves de Sousa, RLarue, VCresteil, TDardel, FArtaud, IMeinnel, T Discovery and refinement of a new structural class of potent peptide deformylase inhibitors. J Med Chem 50:10-20 (2007)  
Target
Name:
Peptide deformylase 1A, chloroplastic/mitochondrial
Synonyms:
AtDEF1 DEF1 PDF 1A Peptide deformylase 1A, chloroplastic | Polypeptide deformylase
Type:
PROTEIN
Mol. Mass.:
30001.50
Organism:
Arabidopsis thaliana
Description:
ChEMBL_423228
Residue:
269
  
Inhibitor
Name:
BDBM50201888
Synonyms:
(1-hydroxycarbamoylmethyl-2-phenylethyl)carbamic acid tert-butyl ester | CHEMBL218819
Type:
Small organic molecule
Emp. Form.:
C15H22N2O4
Mol. Mass.:
294.3462
SMILES:
CC(C)(C)OC(=O)NC(CC(=O)NO)Cc1ccccc1
: